time taken to learn English
definition: Although on its surface the issue may appear simple, the question of how long it takes schoolchildren to learn English well enough to use it effectively in school is not easy to answer definitively. This entry reviews some of the research findings on the subject, with appropriate cautions as to how authoritative any type of answer may be. [Source: Encyclopedia of Bilingual Education; English, How Long to Learn]
broader: teaching and learning
type: Concept

concepts
type: Collection
type: ConceptGroup
member: time taken to learn English

teaching and learning
type: Concept
narrower: time taken to learn English