magazine types
type: Concept
narrower: trade magazines

concepts
type: Collection
type: ConceptGroup
member: trade magazines

trade magazines
definition: Trade magazines are a genre of periodicals intended for specific professional communities. Also known as the trade press, trade magazines differ from general audience publications through their limited focus on a single profession or trade and their use of jargon and concepts familiar to the targeted field. [Source: Encyclopedia of Journalism; Trade Magazines]
broader: magazine types
type: Concept