transfer of knowledge
definition: Day after day, in schools around the world, students memorize state capitols and learn what makes plants grow. Lessons such as these are a vital part of our education system, but they are not the sum total of what students need to master before leaving school. [Source: Encyclopedia of Applied Developmental Science; Transfer of Knowledge, Child Education about the Real World]
broader: development-promoting interventions
type: Concept

concepts
type: Collection
type: ConceptGroup
member: transfer of knowledge

development-promoting interventions
type: Concept
narrower: transfer of knowledge