concepts
type: Collection
type: ConceptGroup
member: transnational voting

transnational voting
definition: Transnational voting is the extension of traditional territorial enfranchisement, or suffrage, beyond national borders. It is typically considered an adaptation of the traditional voting system to global circumstances characterized by overlapping sociopolitical interactions. [Source: The Encyclopedia of Political Science; Transnational Voting]
broader: international relations
type: Concept

international relations
type: Concept
narrower: transnational voting