ultraviolet C radiation
definition: ULTRAVIOLET C (UVC) radiation is one type of radiation that is found on the electromagnetic spectrum. UVC radiation, along with ultraviolet A (UVA) and ultraviolet B (UVB), actually belongs to a larger group of radiation called broad-spectrum UV radiation. [Source: Encyclopedia of Cancer and Society; Ultraviolet C Radiation]
broader: known or suspected carcinogens
type: Concept

known or suspected carcinogens
type: Concept
narrower: ultraviolet C radiation

concepts
type: Collection
type: ConceptGroup
member: ultraviolet C radiation