unconscious
definition: On a mundane level the idea of the unconscious simply suggests that there are aspects of our minds and bodies of which we are not self-conscious and that can be described as causes of our actions. However, the notion of the unconscious is more commonly attributed to the domain of psychoanalysis, where it has specific and technical meanings. [Source: The SAGE Dictionary of Cultural Studies; Unconscious]
broader: philosophy and psychology
type: Concept

philosophy and psychology
type: Concept
narrower: unconscious

concepts
type: Collection
type: ConceptGroup
member: unconscious