business fraud and crimes
type: Concept
narrower: unfair trade practices

unfair trade practices
definition: Unfair trade practices are often thought of as causing disparities in trade between a foreign country and the United States, without a balance of importation of American-made goods. The Example of China The example of China arises frequently in the discussion of unfair trade practices. [Source: Encyclopedia of White-Collar and Corporate Crime; Unfair Trade Practices]
broader: business fraud and crimes
type: Concept

concepts
type: Collection
type: ConceptGroup
member: unfair trade practices