archaeology
type: Concept
narrower: ur

concepts
type: Collection
type: ConceptGroup
member: ur

ur
definition: Located in modern southern Iraq, the ancient site of Ur (Arabic: Tall el-Muqayyar) grew from a modest agricultural village to one of the most important cities of Mesopotamian civilization. Popularly known as the birthplace of Abraham, the Biblical patriarch (Genesis 11:28–31),Ur remained an important economic and religious center from the fifth millennium to the first millennium BCE. Source: . Although several archaeologists had worked there briefly before him, the excavations of British archaeologist C. Leonard Woolley, between 1922 and 1934, produced the bulk of our knowledge on ancient Ur. [Source: Encyclopedia of Anthropology; Ur]
broader: archaeology
type: Concept