urban schooling
definition: Children from wealthy urban families have access to high-quality schools and rich extracurricular experiences. Problematic urban schooling is primarily a phenomenon among children from low socioeconomic status (SES) families, often from low SES neighborhoods. [Source: Sociology of Education: An A-to-Z Guide; Urban Schooling]
broader: school systems, structures, and processes
type: Concept

concepts
type: Collection
type: ConceptGroup
member: urban schooling

school systems, structures, and processes
type: Concept
narrower: urban schooling