leisure activities
type: Concept
narrower: vacations

concepts
type: Collection
type: ConceptGroup
member: vacations

vacations
definition: Throughout American history, individuals have traveled for work, exploration, and adventure. The westward migration also resulted in whole families moving, sometimes across the continent, in an effort to find a better life. [Source: The Social History of the American Family: An Encyclopedia; Vacations]
broader: leisure activities
type: Concept