venture management firms
definition: Venture management firms provide their venture clients with the necessary capital, interim management support, and relevant resources to achieve business tractions for the company's product or service. Donald King and Robert Thornton define venture as an abbreviated word for “entrepreneurial adventure” and a venture management firm as “an organization initiated to capitalize on new products and markets. [Source: Encyclopedia of New Venture Management; Venture Management Firms]
broader: entrepreneurship financing and economic development
type: Concept

entrepreneurship financing and economic development
type: Concept
narrower: venture management firms

concepts
type: Collection
type: ConceptGroup
member: venture management firms