veranda
definition: The veranda can be found across a range of geographies and time periods. It is an exterior, semi-open building element constructed as an extension to or as a separate object attached to a more substantial structure. [Source: Encyclopedia of Urban Studies; Veranda]
broader: urban architecture
type: Concept

urban architecture
type: Concept
narrower: veranda

concepts
type: Collection
type: ConceptGroup
member: veranda