concepts
type: Collection
type: ConceptGroup
member: voluntary recalls

voluntary recalls
definition: Consumer product recalls occur frequently. In 2000, there were at least 2,523 voluntary recalls. [Source: Encyclopedia of Business Ethics and Society; Recalls, Voluntary]
broader: marketing ethics
type: Concept

marketing ethics
type: Concept
narrower: voluntary recalls