walking
definition: Walking is a very common type of low-impact aerobic physical activity. Because our ancestors often spent large portions of their days walking in pursuit of resources, our bodies have evolved in the expectation of frequent exercise. [Source: Encyclopedia of Transportation: Social Science and Policy; Walking]
broader: sports
type: Concept

sports
type: Concept
narrower: walking

concepts
type: Collection
type: ConceptGroup
member: walking