watershed management
definition: Water management is a very broad term that pertains to the design and deployment of planning approaches to access and supply water. The term encompasses the planning and provision of water quantity (adequate volume of supply), water quality (safety of source), and also flood protection. [Source: Encyclopedia of Geography; Watershed Management]
broader: water
type: Concept

concepts
type: Collection
type: ConceptGroup
member: watershed management

water
type: Concept
narrower: watershed management