web service
definition: A Web service is an interoperable and self-describing application that can communicate with other services over the Web services platform. A Web service is an advanced technology framework for Web applications that provides high-level integration of multiple data process functions and information services hosted on different machines. [Source: Encyclopedia of Geographic Information Science; Web Service]
broader: organizational and institutional aspects
type: Concept

concepts
type: Collection
type: ConceptGroup
member: web service

organizational and institutional aspects
type: Concept
narrower: web service