westernization
definition: Westernization refers to the spread of the culture of Western Europe to other parts of the world, such as (but not limited to) Africa. Westernization is closely associated with Western modernity, as it emerged during the European Enlightenment period. [Source: Encyclopedia of Black Studies; Westernization]
broader: concepts in black studies
type: Concept

concepts in black studies
type: Concept
narrower: westernization

concepts
type: Collection
type: ConceptGroup
member: westernization