Americans
type: Concept
narrower: white Americans

concepts
type: Collection
type: ConceptGroup
member: white Americans

white Americans
definition: The identity of White Americans can be described along a number of dimensions. Perhaps the most basic is the statistical portrait derived from numerical data as compiled by the U.S. Census Bureau; however, a more nuanced understanding of this group emerges from consideration of their history, culture, and social location. [Source: Encyclopedia of Counseling; White Americans]
broader: Americans
type: Concept