concepts
type: Collection
type: ConceptGroup
member: workplace deaths

work-related crimes
type: Concept
narrower: workplace deaths

workplace deaths
definition: IN 2001, 5,900 people in the United States were killed at work. The ways people died included motor vehicle deaths, accidents with machines, falls, being struck by objects, electrocutions, and homicides. [Source: Encyclopedia of White-Collar & Corporate Crime; Workplace Deaths]
broader: work-related crimes
type: Concept