ziginette
definition: Ziginette is a gambling card game played with a standard 52-card deck modified by removing the cards numbered eight to 10 (leaving a 40-card deck). Originating in Italy, the game is played in gambling establishments throughout the Western world, but especially in its homeland and the United States. [Source: Encyclopedia of Play in Today's Society; Ziginette]
broader: card games
type: Concept

concepts
type: Collection
type: ConceptGroup
member: ziginette

card games
type: Concept
narrower: ziginette